{"text_format":"1","workbook":"xlsx","n_sheets":8,"sheets":["2012","2013","2014","2015","2016","2017","Today","Stocks"],"not_rendered":{"charts":0,"images":0,"macros":1,"external_links":0,"defined_names":2,"comments":0,"pivot_tables":0},"unopened":[],"bounds":{"document_bytes":16777216,"sheet_cells":100000,"rows_first":2000,"rows_last":500,"rows_between":2000,"halvings":0,"cell_chars":16384,"cell_head_chars":4096},"cells_cut":0,"cells_raw":0,"read":"whole","date_system":"1900"}

{"sheet":"2012","index":0,"n_rows":39,"n_cols":12,"rows_kept":39,"cut":false,"hidden":false,"merged":[[26,5,26,6],[4,0,6,6],[0,0,0,6],[9,0,9,6],[2,0,2,1],[3,0,3,1],[7,0,7,6],[2,3,2,5]]}
["Quickie Stock Market Game"]
[]
["Name:"]
["Period:"]
["It's January, 2011, and you have saved $500 to invest in the stock market. There are fifty stocks you can choose from. Click the \"choose stock\" button. Then in column F, choose how many shares of each stock you will purchase. You must stay as close to $500 as possible. "]
[]
[]
["MAKE SURE TO CHECK THE \"ENABLE\" BUTTON BEFORE BEGINNING!"]
[]
[2012]
[]
[1,{"$f":"VLOOKUP(C12,Stocks!$A$2:$J$101,2,FALSE)","v":"Cardinal Health Inc."},15,{"$f":"VLOOKUP(C12,Stocks!$A$2:$J$101,3,FALSE)","v":"CAH"},{"$f":"VLOOKUP(C12,Stocks!$A$2:$D$101,4,FALSE)","v":41.52},null,{"$f":"E12*F12","v":0},null,null,null,null,{"$f":"RANDBETWEEN(1,100)","v":3}]
[2,{"$f":"VLOOKUP(C13,Stocks!$A$2:$J$101,2,FALSE)","v":"Micron"},14,{"$f":"VLOOKUP(C13,Stocks!$A$2:$J$101,3,FALSE)","v":"MU"},{"$f":"VLOOKUP(C13,Stocks!$A$2:$D$101,4,FALSE)","v":7.76},null,{"$f":"E13*F13","v":0},null,null,null,null,{"$f":"RANDBETWEEN(1,100)","v":59}]
[3,{"$f":"VLOOKUP(C14,Stocks!$A$2:$J$101,2,FALSE)","v":"Ebay"},33,{"$f":"VLOOKUP(C14,Stocks!$A$2:$J$101,3,FALSE)","v":"EBAY"},{"$f":"VLOOKUP(C14,Stocks!$A$2:$D$101,4,FALSE)","v":30.63},null,0,null,null,null,null,99]
[4,{"$f":"VLOOKUP(C15,Stocks!$A$2:$J$101,2,FALSE)","v":"Assurant, Inc."},3,{"$f":"VLOOKUP(C15,Stocks!$A$2:$J$101,3,FALSE)","v":"AIZ"},{"$f":"VLOOKUP(C15,Stocks!$A$2:$D$101,4,FALSE)","v":41.17},null,0,null,null,null,null,80]
[5,{"$f":"VLOOKUP(C16,Stocks!$A$2:$J$101,2,FALSE)","v":"Southwest Airlines"},56,{"$f":"VLOOKUP(C16,Stocks!$A$2:$J$101,3,FALSE)","v":"LUV"},{"$f":"VLOOKUP(C16,Stocks!$A$2:$D$101,4,FALSE)","v":8.52},null,0,null,null,null,null,77]
[null,null,null,null,null,null,{"$f":"SUM(G12:G16)","v":0}]
[]
[]
[null,"2012 Increase",null,{"$f":"'2013'!M6","v":0}]
{"$rows_left_out":20}
{"sheet":"2013","index":1,"n_rows":37,"n_cols":13,"rows_kept":37,"cut":false,"hidden":false,"merged":[[4,11,4,12],[11,11,11,12],[0,0,0,9],[1,0,2,3],[25,2,25,3],[26,2,26,3],[27,2,27,3],[28,2,28,3],[1,5,2,5],[10,0,11,9],[13,3,13,4],[23,1,23,4],[21,0,21,9],[24,2,24,3],[1,6,2,6]]}
[2013]
["2011 Investment Portfolio",null,null,null,"Jan, 2012","# of Shares","Total","Jan, 2013"]
[null,null,null,null,"Stock Price",null,null,"Stock Price"]
[1,{"$f":"'2012'!B12","v":"Cardinal Health Inc."},{"$f":"'2012'!C12","v":15},{"$f":"'2012'!D12","v":"CAH"},{"$f":"'2012'!E12","v":41.52},{"$f":"'2012'!F12","v":0},{"$f":"E4*F4","v":0},null,{"$f":"H4-E4","v":-41.52},{"$f":"F4*H4","v":0}]
[2,{"$f":"'2012'!B13","v":"Micron"},{"$f":"'2012'!C13","v":14},{"$f":"'2012'!D13","v":"MU"},{"$f":"'2012'!E13","v":7.76},{"$f":"'2012'!F13","v":0},{"$f":"E5*F5","v":0},null,{"$f":"H5-E5","v":-7.76},{"$f":"F5*H5","v":0},null,"Stock Portfolio"]
[3,{"$f":"'2012'!B14","v":"Ebay"},{"$f":"'2012'!C14","v":33},{"$f":"'2012'!D14","v":"EBAY"},{"$f":"'2012'!E14","v":30.63},{"$f":"'2012'!F14","v":0},0,null,-30.63,0,null,"Market Gains:",{"$f":"J9-G9","v":0}]
[4,{"$f":"'2012'!B15","v":"Assurant, Inc."},{"$f":"'2012'!C15","v":3},{"$f":"'2012'!D15","v":"AIZ"},{"$f":"'2012'!E15","v":41.17},{"$f":"'2012'!F15","v":0},0,null,-41.17,0,null,"2013 Portfolio:",{"$f":"J9","v":0}]
[5,{"$f":"'2012'!B16","v":"Southwest Airlines"},{"$f":"'2012'!C16","v":56},{"$f":"'2012'!D16","v":"LUV"},{"$f":"'2012'!E16","v":8.52},{"$f":"'2012'!F16","v":0},0,null,-8.52,0,null,"2013 Sell:",{"$f":"F20","v":0}]
[null,null,null,null,null,null,{"$f":"SUM(G4:G8)","v":0},null,null,{"$f":"SUM(J4:J8)","v":0},null,"2013 Buy:",{"$f":"G30","v":0}]
[null,null,null,null,null,null,null,null,null,null,null,null,{"$f":"M7-M8+G30","v":0}]
["SELL"]
[null,null,null,null,null,null,null,null,null,null,null,"Cash"]
[null,null,null,null,null,null,null,null,null,null,null,"Starting Cash",500]
[null,null,null,"Current",null,"Sell",null,null,null,null,null,"Liquid Assets",{"$f":"F20-G30","v":0}]
[null,null,null,{"$f":"D4","v":"CAH"},null,null,null,null,null,null,null,"Total Cash",{"$f":"M13+M14","v":500}]
[null,null,null,{"$f":"D5","v":"MU"}]
[null,null,null,{"$f":"D6","v":"EBAY"}]
[null,null,null,{"$f":"D7","v":"AIZ"}]
[null,null,null,{"$f":"D8","v":"LUV"}]
[null,null,null,null,null,{"$f":"SUM(F15:F19)","v":0}]
{"$rows_left_out":18}
{"sheet":"2014","index":2,"n_rows":41,"n_cols":13,"rows_kept":41,"cut":false,"hidden":false,"merged":[[4,11,4,12],[11,11,11,12],[13,3,13,4],[0,0,0,9],[1,0,2,3],[1,5,2,5],[1,6,2,6],[10,0,11,9],[28,2,28,3],[21,0,21,9],[23,1,23,4],[24,2,24,3],[25,2,25,3],[26,2,26,3],[27,2,27,3]]}
[2014]
["2012 Investment Portfolio",null,null,null,"Jan 2013","# of Shares","Total","Jan, 2014"]
[null,null,null,null,"Stock Price",null,null,"Stock Price"]
[1,{"$f":"VLOOKUP(C4,Stocks!$A$2:$H$101,2,FALSE)","v":"Cardinal Health Inc."},{"$f":"'2013'!H25","v":15},{"$f":"VLOOKUP(C4,Stocks!$A$2:$C$101,3,FALSE)","v":"CAH"},{"$f":"VLOOKUP(C4,Stocks!$A$2:$H$101,5,FALSE)","v":44.64},{"$f":"IF('2013'!F25=\"\",'2013'!F4,'2013'!F25)","v":0},{"$f":"E4*F4","v":0},null,{"$f":"H4-E4","v":-44.64},{"$f":"F4*H4","v":0}]
[2,{"$f":"VLOOKUP(C5,Stocks!$A$2:$H$101,2,FALSE)","v":"Micron"},{"$f":"'2013'!H26","v":14},{"$f":"VLOOKUP(C5,Stocks!$A$2:$C$101,3,FALSE)","v":"MU"},{"$f":"VLOOKUP(C5,Stocks!$A$2:$H$101,5,FALSE)","v":7.89},{"$f":"IF('2013'!F26=\"\",'2013'!F5,'2013'!F26)","v":0},{"$f":"E5*F5","v":0},null,{"$f":"H5-E5","v":-7.89},{"$f":"F5*H5","v":0},null,"Stock Portfolio"]
[3,{"$f":"VLOOKUP(C6,Stocks!$A$2:$H$101,2,FALSE)","v":"Ebay"},{"$f":"'2013'!H27","v":33},{"$f":"VLOOKUP(C6,Stocks!$A$2:$C$101,3,FALSE)","v":"EBAY"},{"$f":"VLOOKUP(C6,Stocks!$A$2:$H$101,5,FALSE)","v":54.21},{"$f":"IF('2013'!F27=\"\",'2013'!F6,'2013'!F27)","v":0},0,null,-54.21,0,null,"Total Increase:",{"$f":"J9-G9","v":0}]
[4,{"$f":"VLOOKUP(C7,Stocks!$A$2:$H$101,2,FALSE)","v":"Assurant, Inc."},{"$f":"'2013'!H28","v":3},{"$f":"VLOOKUP(C7,Stocks!$A$2:$C$101,3,FALSE)","v":"AIZ"},{"$f":"VLOOKUP(C7,Stocks!$A$2:$H$101,5,FALSE)","v":36.19},{"$f":"IF('2013'!F28=\"\",'2013'!F7,'2013'!F28)","v":0},0,null,-36.19,0,null,"2014 Portfolio:",{"$f":"J9","v":0}]
[5,{"$f":"VLOOKUP(C8,Stocks!$A$2:$H$101,2,FALSE)","v":"Southwest Airlines"},{"$f":"'2013'!H29","v":56},{"$f":"VLOOKUP(C8,Stocks!$A$2:$C$101,3,FALSE)","v":"LUV"},{"$f":"VLOOKUP(C8,Stocks!$A$2:$H$101,5,FALSE)","v":11.26},{"$f":"IF('2013'!F29=\"\",'2013'!F8,'2013'!F29)","v":0},0,null,-11.26,0,null,"2014 Sell:",{"$f":"F20","v":0}]
[null,null,null,null,null,null,{"$f":"SUM(G4:G8)","v":0},null,null,{"$f":"SUM(J4:J8)","v":0},null,"2014 Buy:",{"$f":"G30","v":0}]
[null,null,null,null,null,null,null,null,null,null,null,null,{"$f":"M7-M8+M9","v":0}]
["SELL"]
[null,null,null,null,null,null,null,null,null,null,null,"Cash"]
[null,null,null,null,null,null,null,null,null,null,null,"Starting Cash",{"$f":"'2013'!M15","v":500}]
[null,null,null,"Current",null,"Sell",null,null,null,null,null,"Liquid Assets",{"$f":"F20-G30","v":0}]
[null,null,null,{"$f":"D4","v":"CAH"},null,null,null,null,null,null,null,"Total Cash",{"$f":"M13+M14","v":500}]
[null,null,null,{"$f":"D5","v":"MU"}]
[null,null,null,{"$f":"D6","v":"EBAY"}]
[null,null,null,{"$f":"D7","v":"AIZ"}]
[null,null,null,{"$f":"D8","v":"LUV"}]
[null,null,null,null,null,{"$f":"SUM(F15:F19)","v":0}]
{"$rows_left_out":22}
{"sheet":"2015","index":3,"n_rows":37,"n_cols":13,"rows_kept":37,"cut":false,"hidden":false,"merged":[[4,11,4,12],[11,11,11,12],[13,3,13,4],[0,0,0,9],[1,0,2,3],[1,5,2,5],[1,6,2,6],[10,0,11,9],[28,2,28,3],[21,0,21,9],[23,1,23,4],[24,2,24,3],[25,2,25,3],[26,2,26,3],[27,2,27,3]]}
[2015]
["2013 Investment Portfolio",null,null,null,"Jan 2014","# of Shares","Total","Jan, 2015"]
[null,null,null,null,"Stock Price",null,null,"Stock Price"]
[1,{"$f":"VLOOKUP(C4,Stocks!$A$2:$H$101,2,FALSE)","v":"Cardinal Health Inc."},{"$f":"'2014'!H25","v":15},{"$f":"VLOOKUP(C4,Stocks!$A$2:$C$101,3,FALSE)","v":"CAH"},{"$f":"VLOOKUP(C4,Stocks!$A$2:$H$101,6,FALSE)","v":69.319999999999993},{"$f":"IF('2014'!F25=\"\",'2014'!F4,'2014'!F25)","v":0},{"$f":"E4*F4","v":0},null,{"$f":"H4-E4","v":-69.319999999999993},{"$f":"F4*H4","v":0}]
[2,{"$f":"VLOOKUP(C5,Stocks!$A$2:$H$101,2,FALSE)","v":"Micron"},{"$f":"'2014'!H26","v":14},{"$f":"VLOOKUP(C5,Stocks!$A$2:$C$101,3,FALSE)","v":"MU"},{"$f":"VLOOKUP(C5,Stocks!$A$2:$H$101,6,FALSE)","v":20.97},{"$f":"IF('2014'!F26=\"\",'2014'!F5,'2014'!F26)","v":0},{"$f":"E5*F5","v":0},null,{"$f":"H5-E5","v":-20.97},{"$f":"F5*H5","v":0},null,"Stock Portfolio"]
[3,{"$f":"VLOOKUP(C6,Stocks!$A$2:$H$101,2,FALSE)","v":"Ebay"},{"$f":"'2014'!H27","v":33},{"$f":"VLOOKUP(C6,Stocks!$A$2:$C$101,3,FALSE)","v":"EBAY"},{"$f":"VLOOKUP(C6,Stocks!$A$2:$H$101,6,FALSE)","v":52.16},{"$f":"IF('2014'!F27=\"\",'2014'!F6,'2014'!F27)","v":0},0,null,-52.16,0,null,"Total Increase:",{"$f":"J9-G9","v":0}]
[4,{"$f":"VLOOKUP(C7,Stocks!$A$2:$H$101,2,FALSE)","v":"Assurant, Inc."},{"$f":"'2014'!H28","v":3},{"$f":"VLOOKUP(C7,Stocks!$A$2:$C$101,3,FALSE)","v":"AIZ"},{"$f":"VLOOKUP(C7,Stocks!$A$2:$H$101,6,FALSE)","v":67.739999999999995},{"$f":"IF('2014'!F28=\"\",'2014'!F7,'2014'!F28)","v":0},0,null,-67.739999999999995,0,null,"2015 Portfolio:",{"$f":"'2014'!M10","v":0}]
[5,{"$f":"VLOOKUP(C8,Stocks!$A$2:$H$101,2,FALSE)","v":"Southwest Airlines"},{"$f":"'2014'!H29","v":56},{"$f":"VLOOKUP(C8,Stocks!$A$2:$C$101,3,FALSE)","v":"LUV"},{"$f":"VLOOKUP(C8,Stocks!$A$2:$H$101,6,FALSE)","v":21.22},{"$f":"IF('2014'!F29=\"\",'2014'!F8,'2014'!F29)","v":0},0,null,-21.22,0,null,"2015 Sell:",{"$f":"F20","v":0}]
[null,null,null,null,null,null,{"$f":"SUM(G4:G8)","v":0},null,null,{"$f":"SUM(J4:J8)","v":0},null,"2015 Buy:",{"$f":"G30","v":0}]
[null,null,null,null,null,null,null,null,null,null,null,"Total Gain",{"$f":"M7-M8+M9","v":0}]
["SELL"]
[null,null,null,null,null,null,null,null,null,null,null,"Cash"]
[null,null,null,null,null,null,null,null,null,null,null,"Starting Cash",{"$f":"'2014'!M15","v":500}]
[null,null,null,"Current",null,"Sell",null,null,null,null,null,"Liquid Assets",{"$f":"F20-G30","v":0}]
[null,null,null,{"$f":"D4","v":"CAH"},null,null,null,null,null,null,null,"Total Cash",{"$f":"M13+M14","v":500}]
[null,null,null,{"$f":"D5","v":"MU"}]
[null,null,null,{"$f":"D6","v":"EBAY"}]
[null,null,null,{"$f":"D7","v":"AIZ"}]
[null,null,null,{"$f":"D8","v":"LUV"}]
[null,null,null,null,null,{"$f":"SUM(F15:F19)","v":0}]
{"$rows_left_out":18}
{"sheet":"2016","index":4,"n_rows":40,"n_cols":13,"rows_kept":40,"cut":false,"hidden":false,"merged":[[11,11,11,12],[4,11,4,12],[13,3,13,4],[0,0,0,9],[1,0,2,3],[1,5,2,5],[1,6,2,6],[10,0,11,9],[28,2,28,3],[21,0,21,9],[23,1,23,4],[24,2,24,3],[25,2,25,3],[26,2,26,3],[27,2,27,3]]}
[2016]
["2014 Investment Portfolio",null,null,null,"Jan 2015","# of Shares","Total","Jan, 2016"]
[null,null,null,null,"Stock Price",null,null,"Stock Price"]
[1,{"$f":"VLOOKUP(C4,Stocks!$A$2:$H$101,2,FALSE)","v":"Cardinal Health Inc."},{"$f":"'2015'!H25","v":15},{"$f":"VLOOKUP(C4,Stocks!$A$2:$C$101,3,FALSE)","v":"CAH"},{"$f":"VLOOKUP(C4,Stocks!$A$2:$H$101,7,FALSE)","v":80.510000000000005},{"$f":"IF('2015'!F25=\"\",'2015'!F4,'2015'!F25)","v":0},{"$f":"E4*F4","v":0},null,{"$f":"H4-E4","v":-80.510000000000005},{"$f":"F4*H4","v":0}]
[2,{"$f":"VLOOKUP(C5,Stocks!$A$2:$H$101,2,FALSE)","v":"Micron"},{"$f":"'2015'!H26","v":14},{"$f":"VLOOKUP(C5,Stocks!$A$2:$C$101,3,FALSE)","v":"MU"},{"$f":"VLOOKUP(C5,Stocks!$A$2:$H$101,7,FALSE)","v":33.53},{"$f":"IF('2015'!F26=\"\",'2015'!F5,'2015'!F26)","v":0},{"$f":"E5*F5","v":0},null,{"$f":"H5-E5","v":-33.53},{"$f":"F5*H5","v":0},null,"Stock Portfolio"]
[3,{"$f":"VLOOKUP(C6,Stocks!$A$2:$H$101,2,FALSE)","v":"Ebay"},{"$f":"'2015'!H27","v":33},{"$f":"VLOOKUP(C6,Stocks!$A$2:$C$101,3,FALSE)","v":"EBAY"},{"$f":"VLOOKUP(C6,Stocks!$A$2:$H$101,7,FALSE)","v":53},{"$f":"IF('2015'!F27=\"\",'2015'!F6,'2015'!F27)","v":0},0,null,-53,0,null,"Total Increase:",{"$f":"J9-G9","v":0}]
[4,{"$f":"VLOOKUP(C7,Stocks!$A$2:$H$101,2,FALSE)","v":"Assurant, Inc."},{"$f":"'2015'!H28","v":3},{"$f":"VLOOKUP(C7,Stocks!$A$2:$C$101,3,FALSE)","v":"AIZ"},{"$f":"VLOOKUP(C7,Stocks!$A$2:$H$101,7,FALSE)","v":65.180000000000007},{"$f":"IF('2015'!F28=\"\",'2015'!F7,'2015'!F28)","v":0},0,null,-65.180000000000007,0,null,"2016 Portfolio:",{"$f":"J9","v":0}]
[5,{"$f":"VLOOKUP(C8,Stocks!$A$2:$H$101,2,FALSE)","v":"Southwest Airlines"},{"$f":"'2015'!H29","v":56},{"$f":"VLOOKUP(C8,Stocks!$A$2:$C$101,3,FALSE)","v":"LUV"},{"$f":"VLOOKUP(C8,Stocks!$A$2:$H$101,7,FALSE)","v":40.75},{"$f":"IF('2015'!F29=\"\",'2015'!F8,'2015'!F29)","v":0},0,null,-40.75,0,null,"2016 Sell:",{"$f":"F20","v":0}]
[null,null,null,null,null,null,{"$f":"SUM(G4:G8)","v":0},null,null,{"$f":"SUM(J4:J8)","v":0},null,"2016 Buy:",{"$f":"G30","v":0}]
[null,null,null,null,null,null,null,null,null,null,null,null,{"$f":"M7-M8+M9","v":0}]
["SELL"]
[null,null,null,null,null,null,null,null,null,null,null,"Cash"]
[null,null,null,null,null,null,null,null,null,null,null,"Starting Cash",{"$f":"'2015'!M15","v":500}]
[null,null,null,"Current",null,"Sell",null,null,null,null,null,"Liquid Assets",{"$f":"F20-G30","v":0}]
[null,null,null,{"$f":"D4","v":"CAH"},null,null,null,null,null,null,null,"Total Cash",{"$f":"M13+M14","v":500}]
[null,null,null,{"$f":"D5","v":"MU"}]
[null,null,null,{"$f":"D6","v":"EBAY"}]
[null,null,null,{"$f":"D7","v":"AIZ"}]
[null,null,null,{"$f":"D8","v":"LUV"}]
[null,null,null,null,null,{"$f":"SUM(F15:F19)","v":0}]
{"$rows_left_out":21}
{"sheet":"2017","index":5,"n_rows":39,"n_cols":13,"rows_kept":39,"cut":false,"hidden":false,"merged":[[10,0,11,9],[11,11,11,12],[0,0,0,9],[1,0,2,3],[1,5,2,5],[1,6,2,6],[4,11,4,12],[27,2,27,3],[28,2,28,3],[13,3,13,4],[21,0,21,9],[23,1,23,4],[24,2,24,3],[25,2,25,3],[26,2,26,3]]}
[2016]
["2014 Investment Portfolio",null,null,null,"Jan 2016","# of Shares","Total","Jan, 2017"]
[null,null,null,null,"Stock Price",null,null,"Stock Price"]
[1,{"$f":"VLOOKUP(C4,Stocks!$A$2:$H$101,2,FALSE)","v":"Cardinal Health Inc."},{"$f":"'2016'!H25","v":15},{"$f":"VLOOKUP(C4,Stocks!$A$2:$C$101,3,FALSE)","v":"CAH"},{"$f":"VLOOKUP(C4,Stocks!$A$2:$H$101,7,FALSE)","v":80.510000000000005},{"$f":"IF('2016'!F25=\"\",'2016'!F4,'2016'!F25)","v":0},{"$f":"E4*F4","v":0},null,{"$f":"H4-E4","v":-80.510000000000005},{"$f":"F4*H4","v":0}]
[2,{"$f":"VLOOKUP(C5,Stocks!$A$2:$H$101,2,FALSE)","v":"Micron"},{"$f":"'2016'!H26","v":14},{"$f":"VLOOKUP(C5,Stocks!$A$2:$C$101,3,FALSE)","v":"MU"},{"$f":"VLOOKUP(C5,Stocks!$A$2:$H$101,7,FALSE)","v":33.53},{"$f":"IF('2016'!F26=\"\",'2016'!F5,'2016'!F26)","v":0},{"$f":"E5*F5","v":0},null,{"$f":"H5-E5","v":-33.53},{"$f":"F5*H5","v":0},null,"Stock Portfolio"]
[3,{"$f":"VLOOKUP(C6,Stocks!$A$2:$H$101,2,FALSE)","v":"Ebay"},{"$f":"'2016'!H27","v":33},{"$f":"VLOOKUP(C6,Stocks!$A$2:$C$101,3,FALSE)","v":"EBAY"},{"$f":"VLOOKUP(C6,Stocks!$A$2:$H$101,7,FALSE)","v":53},{"$f":"IF('2016'!F27=\"\",'2016'!F6,'2016'!F27)","v":0},0,null,-53,0,null,"Total Increase:",{"$f":"J9-G9","v":0}]
[4,{"$f":"VLOOKUP(C7,Stocks!$A$2:$H$101,2,FALSE)","v":"Assurant, Inc."},{"$f":"'2016'!H28","v":3},{"$f":"VLOOKUP(C7,Stocks!$A$2:$C$101,3,FALSE)","v":"AIZ"},{"$f":"VLOOKUP(C7,Stocks!$A$2:$H$101,7,FALSE)","v":65.180000000000007},{"$f":"IF('2016'!F28=\"\",'2016'!F7,'2016'!F28)","v":0},0,null,-65.180000000000007,0,null,"2017 Portfolio:",{"$f":"J9","v":0}]
[5,{"$f":"VLOOKUP(C8,Stocks!$A$2:$H$101,2,FALSE)","v":"Southwest Airlines"},{"$f":"'2016'!H29","v":56},{"$f":"VLOOKUP(C8,Stocks!$A$2:$C$101,3,FALSE)","v":"LUV"},{"$f":"VLOOKUP(C8,Stocks!$A$2:$H$101,7,FALSE)","v":40.75},{"$f":"IF('2016'!F29=\"\",'2016'!F8,'2016'!F29)","v":0},0,null,-40.75,0,null,"2017 Sell:",{"$f":"F20","v":0}]
[null,null,null,null,null,null,{"$f":"SUM(G4:G8)","v":0},null,null,{"$f":"SUM(J4:J8)","v":0},null,"2017 Buy:",{"$f":"G30","v":0}]
[null,null,null,null,null,null,null,null,null,null,null,null,{"$f":"M7-M8+M9","v":0}]
["SELL"]
[null,null,null,null,null,null,null,null,null,null,null,"Cash"]
[null,null,null,null,null,null,null,null,null,null,null,"Starting Cash",{"$f":"'2015'!M15","v":500}]
[null,null,null,"Current",null,"Sell",null,null,null,null,null,"Liquid Assets",{"$f":"F20-G30","v":0}]
[null,null,null,{"$f":"D4","v":"CAH"},null,null,null,null,null,null,null,"Total Cash",{"$f":"M13+M14","v":500}]
[null,null,null,{"$f":"D5","v":"MU"}]
[null,null,null,{"$f":"D6","v":"EBAY"}]
[null,null,null,{"$f":"D7","v":"AIZ"}]
[null,null,null,{"$f":"D8","v":"LUV"}]
[null,null,null,null,null,{"$f":"SUM(F15:F19)","v":0}]
{"$rows_left_out":20}
{"sheet":"Today","index":6,"n_rows":21,"n_cols":13,"rows_kept":21,"cut":false,"hidden":false,"merged":[[0,0,0,9],[1,0,2,3],[1,5,2,5],[1,6,2,6],[4,11,4,12]]}
["Today"]
["2015 Investment Portfolio",null,null,null,"Jan 2017","# of Shares","Total","Today's"]
[null,null,null,null,"Stock Price",null,null,"Stock Price"]
[1,{"$f":"IF('2017'!B25=\"\",'2017'!B4,'2017'!B25)","v":"Cardinal Health Inc."},{"$f":"'2017'!H25","v":15},{"$f":"VLOOKUP(C4,Stocks!$A$2:$C$101,3,FALSE)","v":"CAH"},{"$f":"VLOOKUP(C4,Stocks!$A$2:$N$101,9,FALSE)","v":73.72},{"$f":"IF('2017'!F25=\"\",'2017'!F4,'2017'!F25)","v":0},{"$f":"E4*F4","v":0},null,{"$f":"H4-E4","v":-73.72},{"$f":"F4*H4","v":0}]
[2,{"$f":"IF('2017'!B26=\"\",'2017'!B5,'2017'!B26)","v":"Micron"},{"$f":"'2017'!H26","v":14},{"$f":"VLOOKUP(C5,Stocks!$A$2:$C$101,3,FALSE)","v":"MU"},{"$f":"VLOOKUP(C5,Stocks!$A$2:$N$101,9,FALSE)","v":22.55},{"$f":"IF('2017'!F26=\"\",'2017'!F5,'2017'!F26)","v":0},{"$f":"E5*F5","v":0},null,{"$f":"H5-E5","v":-22.55},{"$f":"F5*H5","v":0},null,"Stock Portfolio"]
[3,{"$f":"IF('2017'!B27=\"\",'2017'!B6,'2017'!B27)","v":"Ebay"},{"$f":"'2017'!H27","v":33},{"$f":"VLOOKUP(C6,Stocks!$A$2:$C$101,3,FALSE)","v":"EBAY"},{"$f":"VLOOKUP(C6,Stocks!$A$2:$N$101,9,FALSE)","v":37.33},{"$f":"IF('2017'!F27=\"\",'2017'!F6,'2017'!F27)","v":0},0,null,-37.33,0,null,"Total Increase:",{"$f":"J9-G9","v":0}]
[4,{"$f":"IF('2017'!B28=\"\",'2017'!B7,'2017'!B28)","v":"Assurant, Inc."},{"$f":"'2017'!H28","v":3},{"$f":"VLOOKUP(C7,Stocks!$A$2:$C$101,3,FALSE)","v":"AIZ"},{"$f":"VLOOKUP(C7,Stocks!$A$2:$N$101,9,FALSE)","v":95.98},{"$f":"IF('2017'!F28=\"\",'2017'!F7,'2017'!F28)","v":0},0,null,-95.98,0,null,"Today's Portfolio:",{"$f":"J9","v":0}]
[5,{"$f":"IF('2017'!B29=\"\",'2017'!B8,'2017'!B29)","v":"Southwest Airlines"},{"$f":"'2017'!H29","v":56},{"$f":"VLOOKUP(C8,Stocks!$A$2:$C$101,3,FALSE)","v":"LUV"},{"$f":"VLOOKUP(C8,Stocks!$A$2:$N$101,9,FALSE)","v":50.3},{"$f":"IF('2017'!F29=\"\",'2017'!F8,'2017'!F29)","v":0},0,null,-50.3,0,null,"Liquid Assets:",{"$f":"'2016'!M15","v":500}]
[null,null,null,null,null,null,{"$f":"SUM(G4:G8)","v":0},null,null,{"$f":"SUM(J4:J8)","v":0},null,null,{"$f":"SUM(M7:M8)","v":500}]
[]
[]
[]
[]
[]
[]
[]
[]
[]
[]
[]
{"$rows_left_out":2}
{"sheet":"Stocks","index":7,"n_rows":101,"n_cols":24,"rows_kept":101,"cut":false,"hidden":true,"merged":[]}
[null,null,null,2012,2013,2014,2015,2016,2017]
[1,"Apple","AAPL",59.97,74.33,76.13,109.33,96.96,118.99,"NASDAQ"]
[2,"Kroger Co.","KR",12.06,13.23,19.55,34.53,38.81,33.24,"NYSE"]
[3,"Assurant, Inc.","AIZ",41.17,36.19,67.739999999999995,65.180000000000007,77.400000000000006,95.98,"NYSE"]
[4,"Allstate","ALL",23.98,43.21,54.09,70.42,58.44,73.09,"NYSE"]
[5,"McKesson Corporation","MCK",77.239999999999995,103.98,160.71,213.98,170.18,136.74,"NASDAQ"]
[6,"Teva Pharmeceutical","TEVA",45.05,37.729999999999997,39.880000000000003,56.22,63.7,34.590000000000003]
[7,"Avery Dennison Corp","AVY",28.8,35.93,51.15,51.79,58.16,73.17,"NYSE"]
[8,"American Express","AXP",49.76,59.61,86.95,93.02,54.52,76.69,"NYSE"]
[9,"Bank of America Corp","BAC",6.61,12.11,16.41,15.73,13.69,22.68,"NYSE"]
[10,"Intel Corporation","INTC",25.25,21.16,25.85,36.450000000000003,31.51,37.979999999999997]
[11,"Build-a-Bear Workshop","BBW",7.87,4.6100000000000003,8.73,22.44,12.89,13.85,"NYSE"]
[12,"Barnes & Noble","BKS",16.16,12.76,14.68,24.8,8.08,11.1,"NYSE"]
[13,"Citigroup","C",28.55,42.43,54.72,46.95,41.06,59.23,"NYSE"]
[14,"Micron","MU",7.76,7.89,20.97,33.53,11.07,22.55]
[15,"Cardinal Health Inc.","CAH",41.52,44.64,69.319999999999993,80.510000000000005,79.27,73.72,"NYSE"]
[16,"CBS Corporation","CBS",27.79,40.42,63.14,54.79,45.88,65.739999999999995,"NYSE"]
[17,"Carnival Corp","CCL",34.28,37.06,41.36,46.3,49.57,55.83,"NYSE"]
[18,"Colgate ","CL",44.9,53.55,64.7,69.3,62.81,67.36,"NYSE"]
[19,"Comcast Corporation","CMCSA",25.38,38.46,51.07,56.31,53.55,35.08,"NASDAQ"]
{"$rows_left_out":81}