{"text_format":"1","workbook":"xlsx","n_sheets":7,"sheets":["2011","2012","2013","2014","2015","Today","Stocks"],"not_rendered":{"charts":0,"images":0,"macros":1,"external_links":0,"defined_names":1,"comments":0,"pivot_tables":0},"unopened":[],"bounds":{"document_bytes":16777216,"sheet_cells":100000,"rows_first":2000,"rows_last":500,"rows_between":2000,"halvings":0,"cell_chars":16384,"cell_head_chars":4096},"cells_cut":0,"cells_raw":0,"read":"whole","date_system":"1900"}

{"sheet":"2011","index":0,"n_rows":29,"n_cols":7,"rows_kept":29,"cut":false,"hidden":false,"merged":[[25,5,25,6],[4,0,6,6],[0,0,0,6],[9,0,9,6],[2,0,2,1],[2,2,2,4],[3,0,3,1],[3,2,3,3],[7,0,7,6]]}
["Quickie Stock Market Game"]
[]
["Name:",null,"Joseph Winder"]
["Period:",null,4]
["It's January, 2011, and you have saved $500 to invest in the stock market. There are fifty stocks you can choose from. Click the \"choose stock\" button. Then in column F, choose how many shares of each stock you will purchase. You must stay as close to $500 as possible. "]
[]
[]
["MAKE SURE TO CHECK THE \"ENABLE\" BUTTON BEFORE BEGINNING!"]
[]
[2011]
[]
[1,{"$f":"VLOOKUP(C12,Stocks!$A$2:$I$101,2,FALSE)","v":"L-3 Communications"},54,{"$f":"VLOOKUP(C12,Stocks!$A$2:$I$101,3,FALSE)","v":"LLL"},{"$f":"VLOOKUP(C12,Stocks!$A$2:$D$101,4,FALSE)","v":75.87},1,{"$f":"E12*F12","v":75.87}]
[2,{"$f":"VLOOKUP(C13,Stocks!$A$2:$I$101,2,FALSE)","v":"L-3 Communications"},54,{"$f":"VLOOKUP(C13,Stocks!$A$2:$I$101,3,FALSE)","v":"LLL"},{"$f":"VLOOKUP(C13,Stocks!$A$2:$D$101,4,FALSE)","v":75.87},2,{"$f":"E13*F13","v":151.74}]
[3,{"$f":"VLOOKUP(C14,Stocks!$A$2:$I$101,2,FALSE)","v":"General Motors"},38,{"$f":"VLOOKUP(C14,Stocks!$A$2:$I$101,3,FALSE)","v":"GM"},{"$f":"VLOOKUP(C14,Stocks!$A$2:$D$101,4,FALSE)","v":38.979999999999997},1,38.979999999999997]
[4,{"$f":"VLOOKUP(C15,Stocks!$A$2:$I$101,2,FALSE)","v":"Amazon"},5,{"$f":"VLOOKUP(C15,Stocks!$A$2:$I$101,3,FALSE)","v":"AMZN"},{"$f":"VLOOKUP(C15,Stocks!$A$2:$D$101,4,FALSE)","v":185.49},1,185.49]
[5,{"$f":"VLOOKUP(C16,Stocks!$A$2:$I$101,2,FALSE)","v":"Pier 1 Imports"},75,{"$f":"VLOOKUP(C16,Stocks!$A$2:$I$101,3,FALSE)","v":"PIR"},{"$f":"VLOOKUP(C16,Stocks!$A$2:$D$101,4,FALSE)","v":9.43},5,47.15]
[null,null,null,null,null,null,{"$f":"SUM(G12:G16)","v":499.23}]
[]
[]
[null,"2012 Increase",null,{"$f":"'2012'!M6","v":-27}]
{"$rows_left_out":10}
{"sheet":"2012","index":1,"n_rows":30,"n_cols":13,"rows_kept":30,"cut":false,"hidden":false,"merged":[[4,11,4,12],[11,11,11,12],[0,0,0,9],[1,0,2,3],[25,2,25,3],[26,2,26,3],[27,2,27,3],[28,2,28,3],[1,5,2,5],[10,0,11,9],[13,3,13,4],[23,1,23,4],[21,0,21,9],[24,2,24,3],[1,6,2,6]]}
[2012]
["2011 Investment Portfolio",null,null,null,"Jan, 2011","# of Shares","Total","Jan, 2012"]
[null,null,null,null,"Stock Price",null,null,"Stock Price"]
[1,{"$f":"'2011'!B12","v":"L-3 Communications"},{"$f":"'2011'!C12","v":54},{"$f":"'2011'!D12","v":"LLL"},{"$f":"'2011'!E12","v":75.87},{"$f":"'2011'!F12","v":1},{"$f":"E4*F4","v":75.87},{"$f":"VLOOKUP(C4,Stocks!$A$2:$H$101,5,FALSE)","v":67.069999999999993},{"$f":"H4-E4","v":-8.8000000000000114},{"$f":"F4*H4","v":67.069999999999993}]
[2,{"$f":"'2011'!B13","v":"L-3 Communications"},{"$f":"'2011'!C13","v":54},{"$f":"'2011'!D13","v":"LLL"},{"$f":"'2011'!E13","v":75.87},{"$f":"'2011'!F13","v":2},{"$f":"E5*F5","v":151.74},{"$f":"VLOOKUP(C5,Stocks!$A$2:$H$101,5,FALSE)","v":67.069999999999993},{"$f":"H5-E5","v":-8.8000000000000114},{"$f":"F5*H5","v":134.13999999999999},null,"Stock Portfolio"]
[3,{"$f":"'2011'!B14","v":"General Motors"},{"$f":"'2011'!C14","v":38},{"$f":"'2011'!D14","v":"GM"},{"$f":"'2011'!E14","v":38.979999999999997},{"$f":"'2011'!F14","v":1},38.979999999999997,{"$f":"VLOOKUP(C6,Stocks!$A$2:$H$101,5,FALSE)","v":22.92},-16.059999999999995,22.92,null,"Market Gains:",{"$f":"J9-G9","v":-27}]
[4,{"$f":"'2011'!B15","v":"Amazon"},{"$f":"'2011'!C15","v":5},{"$f":"'2011'!D15","v":"AMZN"},{"$f":"'2011'!E15","v":185.49},{"$f":"'2011'!F15","v":1},185.49,{"$f":"VLOOKUP(C7,Stocks!$A$2:$H$101,5,FALSE)","v":173.1},-12.390000000000015,173.1,null,"2012 Portfolio:",{"$f":"J9","v":472.23}]
[5,{"$f":"'2011'!B16","v":"Pier 1 Imports"},{"$f":"'2011'!C16","v":75},{"$f":"'2011'!D16","v":"PIR"},{"$f":"'2011'!E16","v":9.43},{"$f":"'2011'!F16","v":5},47.15,{"$f":"VLOOKUP(C8,Stocks!$A$2:$H$101,5,FALSE)","v":15},5.57,75,null,"2012 Sell:",{"$f":"F20","v":142.07}]
[null,null,null,null,null,null,{"$f":"SUM(G4:G8)","v":499.23},null,null,{"$f":"SUM(J4:J8)","v":472.23},null,"2012 Buy:",{"$f":"G30","v":232.95999999999998}]
[null,null,null,null,null,null,null,null,null,null,null,null,{"$f":"M7-M8+G30","v":563.12}]
["SELL"]
[null,null,null,null,null,null,null,null,null,null,null,"Cash"]
[null,null,null,null,null,null,null,null,null,null,null,"Starting Cash",500]
[null,null,null,"Current",null,"Sell",null,null,null,null,null,"Liquid Assets",{"$f":"F20-G30","v":-90.889999999999986}]
[null,null,null,{"$f":"D4","v":"LLL"},null,{"$f":"J4","v":67.069999999999993},null,null,null,null,null,"Total Cash",{"$f":"M13+M14","v":409.11}]
[null,null,null,{"$f":"D5","v":"LLL"}]
[null,null,null,{"$f":"D6","v":"GM"}]
[null,null,null,{"$f":"D7","v":"AMZN"}]
[null,null,null,{"$f":"D8","v":"PIR"},null,{"$f":"J8","v":75}]
[null,null,null,null,null,{"$f":"SUM(F15:F19)","v":142.07}]
{"$rows_left_out":11}
{"sheet":"2013","index":2,"n_rows":30,"n_cols":13,"rows_kept":30,"cut":false,"hidden":false,"merged":[[4,11,4,12],[11,11,11,12],[13,3,13,4],[0,0,0,9],[1,0,2,3],[1,5,2,5],[1,6,2,6],[10,0,11,9],[28,2,28,3],[21,0,21,9],[23,1,23,4],[24,2,24,3],[25,2,25,3],[26,2,26,3],[27,2,27,3]]}
[2013]
["2012 Investment Portfolio",null,null,null,"Jan 2012","# of Shares","Total","Jan, 2013"]
[null,null,null,null,"Stock Price",null,null,"Stock Price"]
[1,{"$f":"VLOOKUP(C4,Stocks!$A$2:$H$101,2,FALSE)","v":"Metlife"},{"$f":"'2012'!H25","v":61},{"$f":"VLOOKUP(C4,Stocks!$A$2:$C$101,3,FALSE)","v":"MET"},{"$f":"VLOOKUP(C4,Stocks!$A$2:$H$101,5,FALSE)","v":35.24},{"$f":"IF('2012'!F25=\"\",'2012'!F4,'2012'!F25)","v":3},{"$f":"E4*F4","v":105.72},{"$f":"VLOOKUP(C4,Stocks!$A$2:$H$101,6,FALSE)","v":35.950000000000003},{"$f":"H4-E4","v":0.71000000000000085},{"$f":"F4*H4","v":107.85000000000001}]
[2,{"$f":"VLOOKUP(C5,Stocks!$A$2:$H$101,2,FALSE)","v":"L-3 Communications"},{"$f":"'2012'!H26","v":54},{"$f":"VLOOKUP(C5,Stocks!$A$2:$C$101,3,FALSE)","v":"LLL"},{"$f":"VLOOKUP(C5,Stocks!$A$2:$H$101,5,FALSE)","v":67.069999999999993},{"$f":"IF('2012'!F26=\"\",'2012'!F5,'2012'!F26)","v":2},{"$f":"E5*F5","v":134.13999999999999},{"$f":"VLOOKUP(C5,Stocks!$A$2:$H$101,6,FALSE)","v":77.709999999999994},{"$f":"H5-E5","v":10.64},{"$f":"F5*H5","v":155.41999999999999},null,"Stock Portfolio"]
[3,{"$f":"VLOOKUP(C6,Stocks!$A$2:$H$101,2,FALSE)","v":"General Motors"},{"$f":"'2012'!H27","v":38},{"$f":"VLOOKUP(C6,Stocks!$A$2:$C$101,3,FALSE)","v":"GM"},{"$f":"VLOOKUP(C6,Stocks!$A$2:$H$101,5,FALSE)","v":22.92},{"$f":"IF('2012'!F27=\"\",'2012'!F6,'2012'!F27)","v":1},22.92,{"$f":"VLOOKUP(C6,Stocks!$A$2:$H$101,6,FALSE)","v":29.07},6.1499999999999986,29.07,null,"Total Increase:",{"$f":"J9-G9","v":197.19999999999993}]
[4,{"$f":"VLOOKUP(C7,Stocks!$A$2:$H$101,2,FALSE)","v":"Amazon"},{"$f":"'2012'!H28","v":5},{"$f":"VLOOKUP(C7,Stocks!$A$2:$C$101,3,FALSE)","v":"AMZN"},{"$f":"VLOOKUP(C7,Stocks!$A$2:$H$101,5,FALSE)","v":173.1},{"$f":"IF('2012'!F28=\"\",'2012'!F7,'2012'!F28)","v":1},173.1,{"$f":"VLOOKUP(C7,Stocks!$A$2:$H$101,6,FALSE)","v":267.94},94.84,267.94,null,"2013 Portfolio:",{"$f":"J9","v":760.31999999999994}]
[5,{"$f":"VLOOKUP(C8,Stocks!$A$2:$H$101,2,FALSE)","v":"Tyler Technologies"},{"$f":"'2012'!H29","v":89},{"$f":"VLOOKUP(C8,Stocks!$A$2:$C$101,3,FALSE)","v":"TYL"},{"$f":"VLOOKUP(C8,Stocks!$A$2:$H$101,5,FALSE)","v":31.81},{"$f":"IF('2012'!F29=\"\",'2012'!F8,'2012'!F29)","v":4},127.24,{"$f":"VLOOKUP(C8,Stocks!$A$2:$H$101,6,FALSE)","v":50.01},18.2,200.04,null,"2013 Sell:",{"$f":"F20","v":263.27}]
[null,null,null,null,null,null,{"$f":"SUM(G4:G8)","v":563.12},null,null,{"$f":"SUM(J4:J8)","v":760.31999999999994},null,"2013 Buy:",{"$f":"G30","v":237.5}]
[null,null,null,null,null,null,null,null,null,null,null,null,{"$f":"M7-M8+M9","v":734.55}]
["SELL"]
[null,null,null,null,null,null,null,null,null,null,null,"Cash"]
[null,null,null,null,null,null,null,null,null,null,null,"Starting Cash",{"$f":"'2012'!M15","v":409.11}]
[null,null,null,"Current",null,"Sell",null,null,null,null,null,"Liquid Assets",{"$f":"F20-G30","v":25.769999999999982}]
[null,null,null,{"$f":"D4","v":"MET"},null,{"$f":"J4","v":107.85000000000001},null,null,null,null,null,"Total Cash",{"$f":"M13+M14","v":434.88}]
[null,null,null,{"$f":"D5","v":"LLL"},null,{"$f":"J5","v":155.41999999999999}]
[null,null,null,{"$f":"D6","v":"GM"}]
[null,null,null,{"$f":"D7","v":"AMZN"}]
[null,null,null,{"$f":"D8","v":"TYL"}]
[null,null,null,null,null,{"$f":"SUM(F15:F19)","v":263.27}]
{"$rows_left_out":11}
{"sheet":"2014","index":3,"n_rows":30,"n_cols":13,"rows_kept":30,"cut":false,"hidden":false,"merged":[[4,11,4,12],[11,11,11,12],[13,3,13,4],[0,0,0,9],[1,0,2,3],[1,5,2,5],[1,6,2,6],[10,0,11,9],[28,2,28,3],[21,0,21,9],[23,1,23,4],[24,2,24,3],[25,2,25,3],[26,2,26,3],[27,2,27,3]]}
[2014]
["2013 Investment Portfolio",null,null,null,"Jan 2013","# of Shares","Total","Jan, 2014"]
[null,null,null,null,"Stock Price",null,null,"Stock Price"]
[1,{"$f":"VLOOKUP(C4,Stocks!$A$2:$H$101,2,FALSE)","v":"Dr Pepper Snapple"},{"$f":"'2013'!H25","v":29},{"$f":"VLOOKUP(C4,Stocks!$A$2:$C$101,3,FALSE)","v":"DPS"},{"$f":"VLOOKUP(C4,Stocks!$A$2:$H$101,6,FALSE)","v":45.3},{"$f":"IF('2013'!F25=\"\",'2013'!F4,'2013'!F25)","v":1},{"$f":"E4*F4","v":45.3},{"$f":"VLOOKUP(C4,Stocks!$A$2:$H$101,7,FALSE)","v":47.88},{"$f":"H4-E4","v":2.5800000000000054},{"$f":"F4*H4","v":47.88}]
[2,{"$f":"VLOOKUP(C5,Stocks!$A$2:$H$101,2,FALSE)","v":"Toyota"},{"$f":"'2013'!H26","v":86},{"$f":"VLOOKUP(C5,Stocks!$A$2:$C$101,3,FALSE)","v":"TM"},{"$f":"VLOOKUP(C5,Stocks!$A$2:$H$101,6,FALSE)","v":96.1},{"$f":"IF('2013'!F26=\"\",'2013'!F5,'2013'!F26)","v":2},{"$f":"E5*F5","v":192.2},{"$f":"VLOOKUP(C5,Stocks!$A$2:$H$101,7,FALSE)","v":119.19},{"$f":"H5-E5","v":23.090000000000003},{"$f":"F5*H5","v":238.38},null,"Stock Portfolio"]
[3,{"$f":"VLOOKUP(C6,Stocks!$A$2:$H$101,2,FALSE)","v":"General Motors"},{"$f":"'2013'!H27","v":38},{"$f":"VLOOKUP(C6,Stocks!$A$2:$C$101,3,FALSE)","v":"GM"},{"$f":"VLOOKUP(C6,Stocks!$A$2:$H$101,6,FALSE)","v":29.07},{"$f":"IF('2013'!F27=\"\",'2013'!F6,'2013'!F27)","v":1},29.07,{"$f":"VLOOKUP(C6,Stocks!$A$2:$H$101,7,FALSE)","v":36.08},7.009999999999998,36.08,null,"Total Increase:",{"$f":"J9-G9","v":409.20000000000005}]
[4,{"$f":"VLOOKUP(C7,Stocks!$A$2:$H$101,2,FALSE)","v":"Amazon"},{"$f":"'2013'!H28","v":5},{"$f":"VLOOKUP(C7,Stocks!$A$2:$C$101,3,FALSE)","v":"AMZN"},{"$f":"VLOOKUP(C7,Stocks!$A$2:$H$101,6,FALSE)","v":267.94},{"$f":"IF('2013'!F28=\"\",'2013'!F7,'2013'!F28)","v":1},267.94,{"$f":"VLOOKUP(C7,Stocks!$A$2:$H$101,7,FALSE)","v":399.61},131.67000000000002,399.61,null,"2013 Portfolio:",{"$f":"'2013'!M10","v":734.55}]
[5,{"$f":"VLOOKUP(C8,Stocks!$A$2:$H$101,2,FALSE)","v":"Tyler Technologies"},{"$f":"'2013'!H29","v":89},{"$f":"VLOOKUP(C8,Stocks!$A$2:$C$101,3,FALSE)","v":"TYL"},{"$f":"VLOOKUP(C8,Stocks!$A$2:$H$101,6,FALSE)","v":50.01},{"$f":"IF('2013'!F29=\"\",'2013'!F8,'2013'!F29)","v":4},200.04,{"$f":"VLOOKUP(C8,Stocks!$A$2:$H$101,7,FALSE)","v":105.45},55.440000000000005,421.8,null,"2013 Sell:",{"$f":"F20","v":421.8}]
[null,null,null,null,null,null,{"$f":"SUM(G4:G8)","v":734.55},null,null,{"$f":"SUM(J4:J8)","v":1143.75},null,"2013 Buy:",{"$f":"G30","v":815.25}]
[null,null,null,null,null,null,null,null,null,null,null,"Total Gain",{"$f":"M7-M8+M9","v":1128}]
["SELL"]
[null,null,null,null,null,null,null,null,null,null,null,"Cash"]
[null,null,null,null,null,null,null,null,null,null,null,"Starting Cash",{"$f":"'2013'!M15","v":434.88}]
[null,null,null,"Current",null,"Sell",null,null,null,null,null,"Liquid Assets",{"$f":"F20-G30","v":-393.45}]
[null,null,null,{"$f":"D4","v":"DPS"},null,null,null,null,null,null,null,"Total Cash",{"$f":"M13+M14","v":41.430000000000007}]
[null,null,null,{"$f":"D5","v":"TM"}]
[null,null,null,{"$f":"D6","v":"GM"}]
[null,null,null,{"$f":"D7","v":"AMZN"}]
[null,null,null,{"$f":"D8","v":"TYL"},null,{"$f":"J8","v":421.8}]
[null,null,null,null,null,{"$f":"SUM(F15:F19)","v":421.8}]
{"$rows_left_out":11}
{"sheet":"2015","index":4,"n_rows":30,"n_cols":13,"rows_kept":30,"cut":false,"hidden":false,"merged":[[11,11,11,12],[4,11,4,12],[13,3,13,4],[0,0,0,9],[1,0,2,3],[1,5,2,5],[1,6,2,6],[10,0,11,9],[28,2,28,3],[21,0,21,9],[23,1,23,4],[24,2,24,3],[25,2,25,3],[26,2,26,3],[27,2,27,3]]}
[2015]
["2014 Investment Portfolio",null,null,null,"Jan 2014","# of Shares","Total","Jan, 2015"]
[null,null,null,null,"Stock Price",null,null,"Stock Price"]
[1,{"$f":"VLOOKUP(C4,Stocks!$A$2:$H$101,2,FALSE)","v":"Dr Pepper Snapple"},{"$f":"'2014'!H25","v":29},{"$f":"VLOOKUP(C4,Stocks!$A$2:$C$101,3,FALSE)","v":"DPS"},{"$f":"VLOOKUP(C4,Stocks!$A$2:$H$101,7,FALSE)","v":47.88},{"$f":"IF('2014'!F25=\"\",'2014'!F4,'2014'!F25)","v":1},{"$f":"E4*F4","v":47.88},{"$f":"VLOOKUP(C4,Stocks!$A$2:$H$101,8,FALSE)","v":71.599999999999994},{"$f":"H4-E4","v":23.719999999999992},{"$f":"F4*H4","v":71.599999999999994}]
[2,{"$f":"VLOOKUP(C5,Stocks!$A$2:$H$101,2,FALSE)","v":"Toyota"},{"$f":"'2014'!H26","v":86},{"$f":"VLOOKUP(C5,Stocks!$A$2:$C$101,3,FALSE)","v":"TM"},{"$f":"VLOOKUP(C5,Stocks!$A$2:$H$101,7,FALSE)","v":119.19},{"$f":"IF('2014'!F26=\"\",'2014'!F5,'2014'!F26)","v":2},{"$f":"E5*F5","v":238.38},{"$f":"VLOOKUP(C5,Stocks!$A$2:$H$101,8,FALSE)","v":128.88},{"$f":"H5-E5","v":9.6899999999999977},{"$f":"F5*H5","v":257.76},null,"Stock Portfolio"]
[3,{"$f":"VLOOKUP(C6,Stocks!$A$2:$H$101,2,FALSE)","v":"General Motors"},{"$f":"'2014'!H27","v":38},{"$f":"VLOOKUP(C6,Stocks!$A$2:$C$101,3,FALSE)","v":"GM"},{"$f":"VLOOKUP(C6,Stocks!$A$2:$H$101,7,FALSE)","v":36.08},{"$f":"IF('2014'!F27=\"\",'2014'!F6,'2014'!F27)","v":1},36.08,{"$f":"VLOOKUP(C6,Stocks!$A$2:$H$101,8,FALSE)","v":32.619999999999997},-3.4600000000000009,32.619999999999997,null,"Total Increase:",{"$f":"J9-G9","v":359.36999999999989}]
[4,{"$f":"VLOOKUP(C7,Stocks!$A$2:$H$101,2,FALSE)","v":"Amazon"},{"$f":"'2014'!H28","v":5},{"$f":"VLOOKUP(C7,Stocks!$A$2:$C$101,3,FALSE)","v":"AMZN"},{"$f":"VLOOKUP(C7,Stocks!$A$2:$H$101,7,FALSE)","v":399.61},{"$f":"IF('2014'!F28=\"\",'2014'!F7,'2014'!F28)","v":1},399.61,{"$f":"VLOOKUP(C7,Stocks!$A$2:$H$101,8,FALSE)","v":308.52},-91.090000000000032,308.52,null,"2014 Portfolio:",{"$f":"J9","v":1896.57}]
[5,{"$f":"VLOOKUP(C8,Stocks!$A$2:$H$101,2,FALSE)","v":"Regeneron Pharmaceuticals"},{"$f":"'2014'!H29","v":78},{"$f":"VLOOKUP(C8,Stocks!$A$2:$C$101,3,FALSE)","v":"REGN"},{"$f":"VLOOKUP(C8,Stocks!$A$2:$H$101,7,FALSE)","v":271.75},{"$f":"IF('2014'!F29=\"\",'2014'!F8,'2014'!F29)","v":3},815.25,{"$f":"VLOOKUP(C8,Stocks!$A$2:$H$101,8,FALSE)","v":408.69},136.94,1226.07,null,"2014 Sell:",{"$f":"F20","v":1226.07}]
[null,null,null,null,null,null,{"$f":"SUM(G4:G8)","v":1537.2},null,null,{"$f":"SUM(J4:J8)","v":1896.57},null,"2014 Buy:",{"$f":"G30","v":124.68}]
[null,null,null,null,null,null,null,null,null,null,null,null,{"$f":"M7-M8+M9","v":795.18000000000006}]
["SELL"]
[null,null,null,null,null,null,null,null,null,null,null,"Cash"]
[null,null,null,null,null,null,null,null,null,null,null,"Starting Cash",{"$f":"'2014'!M15","v":41.430000000000007}]
[null,null,null,"Current",null,"Sell",null,null,null,null,null,"Liquid Assets",{"$f":"F20-G30","v":1101.3899999999999}]
[null,null,null,{"$f":"D4","v":"DPS"},null,null,null,null,null,null,null,"Total Cash",{"$f":"M13+M14","v":1142.82}]
[null,null,null,{"$f":"D5","v":"TM"}]
[null,null,null,{"$f":"D6","v":"GM"}]
[null,null,null,{"$f":"D7","v":"AMZN"}]
[null,null,null,{"$f":"D8","v":"REGN"},null,{"$f":"J8","v":1226.07}]
[null,null,null,null,null,{"$f":"SUM(F15:F19)","v":1226.07}]
{"$rows_left_out":11}
{"sheet":"Today","index":5,"n_rows":9,"n_cols":13,"rows_kept":9,"cut":false,"hidden":false,"merged":[[0,0,0,9],[1,0,2,3],[1,5,2,5],[1,6,2,6],[4,11,4,12]]}
["Today"]
["2015 Investment Portfolio",null,null,null,"Jan 2015","# of Shares","Total","Today's"]
[null,null,null,null,"Stock Price",null,null,"Stock Price"]
[1,{"$f":"IF('2015'!B25=\"\",'2015'!B4,'2015'!B25)","v":"Dr Pepper Snapple"},{"$f":"'2015'!H25","v":29},{"$f":"VLOOKUP(C4,Stocks!$A$2:$C$101,3,FALSE)","v":"DPS"},{"$f":"VLOOKUP(C4,Stocks!$A$2:$M$101,8,FALSE)","v":71.599999999999994},{"$f":"IF('2015'!F25=\"\",'2015'!F4,'2015'!F25)","v":1},{"$f":"E4*F4","v":71.599999999999994},86.26,{"$f":"H4-E4","v":14.660000000000011},{"$f":"F4*H4","v":86.26}]
[2,{"$f":"IF('2015'!B26=\"\",'2015'!B5,'2015'!B26)","v":"Toyota"},{"$f":"'2015'!H26","v":86},{"$f":"VLOOKUP(C5,Stocks!$A$2:$C$101,3,FALSE)","v":"TM"},{"$f":"VLOOKUP(C5,Stocks!$A$2:$M$101,8,FALSE)","v":128.88},{"$f":"IF('2015'!F26=\"\",'2015'!F5,'2015'!F26)","v":2},{"$f":"E5*F5","v":257.76},122.92,{"$f":"H5-E5","v":-5.9599999999999937},{"$f":"F5*H5","v":245.84},null,"Stock Portfolio"]
[3,{"$f":"IF('2015'!B27=\"\",'2015'!B6,'2015'!B27)","v":"General Motors"},{"$f":"'2015'!H27","v":38},{"$f":"VLOOKUP(C6,Stocks!$A$2:$C$101,3,FALSE)","v":"GM"},{"$f":"VLOOKUP(C6,Stocks!$A$2:$M$101,8,FALSE)","v":32.619999999999997},{"$f":"IF('2015'!F27=\"\",'2015'!F6,'2015'!F27)","v":1},32.619999999999997,35.75,3.1300000000000026,35.75,null,"Total Increase:",{"$f":"J9-G9","v":362.07999999999993}]
[4,{"$f":"IF('2015'!B28=\"\",'2015'!B7,'2015'!B28)","v":"Amazon"},{"$f":"'2015'!H28","v":5},{"$f":"VLOOKUP(C7,Stocks!$A$2:$C$101,3,FALSE)","v":"AMZN"},{"$f":"VLOOKUP(C7,Stocks!$A$2:$M$101,8,FALSE)","v":308.52},{"$f":"IF('2015'!F28=\"\",'2015'!F7,'2015'!F28)","v":1},308.52,659.37,350.85,659.37,null,"Today's Portfolio:",{"$f":"J9","v":1157.26}]
[5,{"$f":"IF('2015'!B29=\"\",'2015'!B8,'2015'!B29)","v":"Honda"},{"$f":"'2015'!H29","v":43},{"$f":"VLOOKUP(C8,Stocks!$A$2:$C$101,3,FALSE)","v":"HMC"},{"$f":"VLOOKUP(C8,Stocks!$A$2:$M$101,8,FALSE)","v":31.17},{"$f":"IF('2015'!F29=\"\",'2015'!F8,'2015'!F29)","v":4},124.68,32.51,1.3399999999999963,130.04,null,"Liquid Assets:",{"$f":"'2015'!M15","v":1142.82}]
[null,null,null,null,null,null,{"$f":"SUM(G4:G8)","v":795.18000000000006},null,null,{"$f":"SUM(J4:J8)","v":1157.26},null,null,{"$f":"SUM(M7:M8)","v":2300.08}]

{"sheet":"Stocks","index":6,"n_rows":101,"n_cols":22,"rows_kept":101,"cut":false,"hidden":false,"merged":[]}
[null,null,null,2011,2012,2013,2014,2015]
[1,"Apple","AAPL",48.02,59.97,74.33,76.13,109.33,"NASDAQ"]
[2,"Alliance Fiber Optic","ADS",71.64,108.49,151.1,256.89,289.55,"NYSE"]
[3,"Assurant, Inc.","AIZ",39.31,41.17,36.19,67.739999999999995,65.180000000000007,"NYSE"]
[4,"Allstate","ALL",31.35,23.98,43.21,54.09,70.42,"NYSE"]
[5,"Amazon","AMZN",185.49,173.1,267.94,399.61,308.52,"NASDAQ"]
[6,"Aeropostale","ARO",24.83,16.39,13.81,7.71,2.97,"NYSE"]
[7,"Avery Dennison Corp","AVY",41.49,28.8,35.93,51.15,51.79,"NYSE"]
[8,"American Express","AXP",46,49.76,59.61,86.95,93.02,"NYSE"]
[9,"Bank of America Corp","BAC",15.25,6.61,12.11,16.41,15.73,"NYSE"]
[10,"Blackberry","BBRY",64.77,16.170000000000002,17.54,9.08,10.38,"NYSE"]
[11,"Build-a-Bear Workshop","BBW",7.61,7.87,4.6100000000000003,8.73,22.44,"NYSE"]
[12,"Barnes & Noble","BKS",16.88,16.16,12.76,14.68,24.8,"NYSE"]
[13,"Citigroup","C",51.3,28.55,42.43,54.72,46.95,"NYSE"]
[14,"Cabelas Inc","CAB",22.15,25.15,51.92,65.790000000000006,54.93,"NYSE"]
[15,"Cardinal Health Inc.","CAH",40.590000000000003,41.52,44.64,69.319999999999993,80.510000000000005,"NYSE"]
[16,"CBS Corporation","CBS",19.940000000000001,27.79,40.42,63.14,54.79,"NYSE"]
[17,"Carnival Corp","CCL",47.85,34.28,37.06,41.36,46.3,"NYSE"]
[18,"Colgate ","CL",39.159999999999997,44.9,53.55,64.7,69.3,"NYSE"]
[19,"Comcast Corporation","CMCSA",22.84,25.38,38.46,51.07,56.31,"NASDAQ"]
{"$rows_left_out":81}